Target
Carbonic anhydrase 14
Ligand
BDBM50366067
Substrate
Meas. Tech.
ChEMBL_807746 (CHEMBL1959874)
Ki
8.4±n/a nM
Citation
 Moeker, JTeruya, KRossit, SWilkinson, BLLopez, MBornaghi, LFInnocenti, ASupuran, CTPoulsen, SA Design and synthesis of thiourea compounds that inhibit transmembrane anchored carbonic anhydrases. Bioorg Med Chem 20:2392-404 (2012)  
Target
Name:
Carbonic anhydrase 14
Synonyms:
CA-XIV CAH14_HUMAN Carbonic Anhydrase XIV Carbonic anhydrase 14 Carbonic anhydrase XIV (CA XIV)
Type:
Enzyme
Mol. Mass.:
37665.67
Organism:
Homo sapiens (Human)
Description:
Human (cloned) isozyme.
Residue:
337
  
Inhibitor
Name:
BDBM50366067
Synonyms:
CHEMBL1956773
Type:
Small organic molecule
Emp. Form.:
C21H33N3O12S2
Mol. Mass.:
583.63
SMILES:
NS(=O)(=O)c1ccc(CCNC(=S)N[C@@H]2O[C@H](CO)[C@@H](O[C@@H]3O[C@H](CO)[C@H](O)[C@H](O)[C@H]3O)[C@H](O)[C@H]2O)cc1
: