Target
Proto-oncogene tyrosine-protein kinase Src
Ligand
BDBM50366114
Substrate
Meas. Tech.
ChEMBL_808134 (CHEMBL1960851)
IC50
>35000±n/a nM
Citation
 Hundsdörfer, CHemmerling, HJGötz, CTotzke, FBednarski, PLe Borgne, MJose, J Indeno[1,2-b]indole derivatives as a novel class of potent human protein kinase CK2 inhibitors. Bioorg Med Chem 20:2282-9 (2012)  
Target
Name:
Proto-oncogene tyrosine-protein kinase Src
Synonyms:
Calmodulin/Proto-oncogene tyrosine-protein kinase Src Proto-oncogene c-Src SRC SRC_HUMAN V-src sarcoma (Schmidt-Ruppin A-2) viral oncogene homolog (avian) p60-Src | pp60c-src
Type:
Protein
Mol. Mass.:
59838.60
Organism:
Homo sapiens (Human)
Description:
P12931
Residue:
536
  
Inhibitor
Name:
BDBM50366114
Synonyms:
CHEMBL1957190
Type:
Small organic molecule
Emp. Form.:
C18H17NO2
Mol. Mass.:
279.3331
SMILES:
CC(C)n1c2CCCC(=O)c2c2C(=O)c3ccccc3-c12
: