Target
Leukotriene A-4 hydrolase
Ligand
BDBM50046339
Substrate
Meas. Tech.
ChEBML_96937
IC50
>1000000±n/a nM
Citation
 Yuan, WZhong, ZWong, CHaeggstrom, JZWetterholm, ASamuelsson, B Probing the inhibition of leukotriene A4 hydrolase based on its aminopeptidase activity Bioorg Med Chem Lett 1:551-556 (1991)    Article 
Target
Name:
Leukotriene A-4 hydrolase
Synonyms:
LKHA4_HUMAN LTA4 Leukotriene A(4) hydrolase Leukotriene A4 hydrolase
Type:
Hydrolase; metalloprotease
Mol. Mass.:
69280.41
Organism:
Homo sapiens (Human)
Description:
Human recombinant LTA4H.
Residue:
611
  
Inhibitor
Name:
BDBM50046339
Synonyms:
(2S,3S)-3-Amino-2-hydroxy-4-phenyl-butyric acid 3-Amino-2-hydroxy-4-phenyl-butyric acid | CHEMBL302932
Type:
Small organic molecule
Emp. Form.:
C10H13NO3
Mol. Mass.:
195.2151
SMILES:
N[C@@H](Cc1ccccc1)[C@H](O)C(O)=O
: