Target
Angiotensin-converting enzyme
Ligand
BDBM50279824
Substrate
Meas. Tech.
ChEMBL_35567 (CHEMBL647515)
IC50
0.290000±n/a nM
Citation
 Ojima, IJameison, FA A new potent inhibitor for angiotensin converting enzyme: (R,S)-captopril-F3 Bioorg Med Chem Lett 1:581-584 (1991)    Article 
Target
Name:
Angiotensin-converting enzyme
Synonyms:
3.2.1.- ACE Angiotensin-converting enzyme, soluble form DCP1 Kininase II
Type:
Mol. Mass.:
150405.15
Organism:
Oryctolagus cuniculus
Description:
Residue:
1310
  
Inhibitor
Name:
BDBM50279824
Synonyms:
(S)-1-((R)-3,3,3-Trifluoro-2-mercaptomethyl-propionyl)-pyrrolidine-2-carboxylic acid | CHEMBL347388
Type:
Small organic molecule
Emp. Form.:
C9H12F3NO3S
Mol. Mass.:
271.257
SMILES:
OC(=O)[C@@H]1CCCN1C(=O)[C@@H](CS)C(F)(F)F
: