Target
Substance-P receptor
Ligand
BDBM50002653
Substrate
Meas. Tech.
ChEBML_208663
IC50
800±n/a nM
Citation
 Howson, WHodgson, JRichardson, RWalton, LGuard, SWatling, K An SAR study for the non-peptide substance P receptor (NK1) antagonist, CP-96,345. Bioorg Med Chem Lett 2:559-564 (1992)    Article 
Target
Name:
Substance-P receptor
Synonyms:
NK-1 receptor NK1 Receptor Neurokinin 1 receptor SPR Tac1r Tacr1
Type:
G Protein-Coupled Receptor (GPCR)
Mol. Mass.:
46371.54
Organism:
Rattus norvegicus (rat)
Description:
Competition binding assays were carried out using membrane preparations from transfected CHO cells that constitutively expressed the rat NK1 receptor.
Residue:
407
  
Inhibitor
Name:
BDBM50002653
Synonyms:
((2R,3S)-2-Benzhydryl-1-aza-bicyclo[2.2.2]oct-3-yl)-(2-methoxy-benzyl)-amine CHEMBL419500 | [(2R,3R)-2-(2,2-Diphenyl-ethyl)-1-aza-bicyclo[2.2.2]oct-3-yl]-(2-methoxy-benzyl)-amine
Type:
Small organic molecule
Emp. Form.:
C28H32N2O
Mol. Mass.:
412.5665
SMILES:
COc1ccccc1CN[C@H]1C2CCN(CC2)[C@@H]1C(c1ccccc1)c1ccccc1
: