Target
Mu-type opioid receptor
Ligand
BDBM50281811
Substrate
Meas. Tech.
ChEBML_138746
Ki
>10000±n/a nM
Citation
 Cain, GAChristos, TEJohnson, ALPottorf, RSConfalone, PNWilliam Tam, SSchmidt, WK Neurotensin receptor binding and antinociceptive activity for lipophilic N-amido neurotensin(913) analogs Bioorg Med Chem Lett 3:2055-2060 (1993)    Article 
Target
Name:
Mu-type opioid receptor
Synonyms:
M-OR-1 Mu opioid receptor OPIATE Mu OPRM_CAVPO
Type:
Enzyme Catalytic Domain
Mol. Mass.:
11165.58
Organism:
GUINEA PIG
Description:
P97266
Residue:
98
  
Inhibitor
Name:
BDBM50281811
Synonyms:
(S)-2-{(2S,3S)-2-[(S)-2-[((S)-1-{(S)-2-[(Adamantane-1-carbonyl)-amino]-6-amino-hexanoyl}-pyrrolidine-2-carbonyl)-amino]-3-(4-hydroxy-phenyl)-propionylamino]-3-methyl-pentanoylamino}-4-methyl-pentanoic acid | CHEMBL2372106
Type:
Small organic molecule
Emp. Form.:
C43H66N6O8
Mol. Mass.:
795.0195
SMILES:
CC[C@H](C)[C@H](NC(=O)[C@H](Cc1ccc(O)cc1)NC(=O)[C@@H]1CCCN1C(=O)[C@H](CCCCN)NC(=O)C12CC3CC(CC(C3)C1)C2)C(=O)N[C@@H](CC(C)C)C(O)=O
: