Target
Adenosylhomocysteinase
Ligand
BDBM50281613
Substrate
Meas. Tech.
ChEBML_197376
IC50
18±n/a nM
Citation
 Siddiqi, SMRaissian, MSchneller, SWIkeda, SSnoeck, RAndrei, GBalzarini, JDe Clerq, E ()-7-deazaaristeromycin lacking the hydroxymethyl substituent Bioorg Med Chem Lett 3:663-666 (1993)    Article 
Target
Name:
Adenosylhomocysteinase
Synonyms:
AHCY SAHH | SAHH_HUMAN
Type:
PROTEIN
Mol. Mass.:
47714.06
Organism:
Homo sapiens (Human)
Description:
ChEMBL_1507791
Residue:
432
  
Inhibitor
Name:
BDBM50281613
Synonyms:
3-(4-Amino-imidazo[4,5-c]pyridin-1-yl)-5-hydroxymethyl-cyclopentane-1,2-diol | CHEMBL281337
Type:
Small organic molecule
Emp. Form.:
C12H16N4O3
Mol. Mass.:
264.2804
SMILES:
Nc1ccnc2n(cnc12)[C@@H]1C[C@H](CO)[C@@H](O)[C@H]1O
: