Target
Type-1 angiotensin II receptor
Ligand
BDBM50041969
Substrate
Meas. Tech.
ChEMBL_36938 (CHEMBL650273)
IC50
0.100000±n/a nM
Citation
 Glinka, TWde Laszlo, SETran, JChang, RSChen, TLotti, VJGreenlee, WJ L-161,638: A potent AT2selective quinazolinone angiotensin II binding inhibitor Bioorg Med Chem Lett 4:1479-1484 (1994)    Article 
Target
Name:
Type-1 angiotensin II receptor
Synonyms:
AGTR1 ANGIOTENSIN AT1 Angiotensin II type 1a (AT-1a) receptor
Type:
Enzyme Catalytic Domain
Mol. Mass.:
41009.15
Organism:
RABBIT
Description:
ANGIOTENSIN AT1 AGTR1 RABBIT::P34976
Residue:
359
  
Inhibitor
Name:
BDBM50041969
Synonyms:
3-{2-Butyl-4-oxo-3-[2'-(1H-tetrazol-5-yl)-biphenyl-4-ylmethyl]-3,4-dihydro-quinazolin-6-yl}-1-isopropyl-1-methyl-urea CHEMBL24322 | L-159093
Type:
Small organic molecule
Emp. Form.:
C31H34N8O2
Mol. Mass.:
550.6541
SMILES:
CCCCc1nc2ccc(NC(=O)N(C)C(C)C)cc2c(=O)n1Cc1ccc(cc1)-c1ccccc1-c1nnn[nH]1
: