Target
Type-2 angiotensin II receptor
Ligand
BDBM50049182
Substrate
Meas. Tech.
ChEMBL_35565 (CHEMBL647513)
IC50
0.58±n/a nM
Citation
 Glinka, TWde Laszlo, SETran, JChang, RSChen, TLotti, VJGreenlee, WJ L-161,638: A potent AT2selective quinazolinone angiotensin II binding inhibitor Bioorg Med Chem Lett 4:1479-1484 (1994)    Article 
Target
Name:
Type-2 angiotensin II receptor
Synonyms:
AGTR2 AT2 Angiotensin II type 2 (AT-2) receptor Type-2 angiotensin II receptor
Type:
Enzyme Catalytic Domain
Mol. Mass.:
41201.61
Organism:
Homo sapiens (Human)
Description:
Angiotensin II, central 0 0::P50052
Residue:
363
  
Inhibitor
Name:
BDBM50049182
Synonyms:
(S)-5-Benzyloxy-2-diphenylacetyl-6-methoxy-1,2,3,4-tetrahydro-isoquinoline-3-carboxylic acid PD-126055
Type:
Small organic molecule
Emp. Form.:
C32H29NO5
Mol. Mass.:
507.5764
SMILES:
COc1ccc2CN([C@@H](Cc2c1OCc1ccccc1)C(O)=O)C(=O)C(c1ccccc1)c1ccccc1
: