Target
Aminopeptidase B
Ligand
BDBM50282728
Substrate
Meas. Tech.
ChEMBL_35336 (CHEMBL645443)
IC50
44000±n/a nM
Citation
 Luisa Sua rez-Gea, MGarci a-Lo pez, TPe rez, CHerranz, R Pseudopeptide inhibitors of aminopeptidases containing the [CH(CN)NH] surrogate as a transition-state MIMIC Bioorg Med Chem Lett 4:1491-1496 (1994)    Article 
Target
Name:
Aminopeptidase B
Synonyms:
AMPB_MOUSE Arginine aminopeptidase Cytosol aminopeptidase IV | Rnpep
Type:
PROTEIN
Mol. Mass.:
72401.87
Organism:
Mus musculus
Description:
ChEMBL_35337
Residue:
650
  
Inhibitor
Name:
BDBM50282728
Synonyms:
CHEMBL36081 | methyl (2S)-6-amino-2-{[(2S)-2-amino-1-cyano-3-phenylpropyl]amino}hexanoate
Type:
Small organic molecule
Emp. Form.:
C17H26N4O2
Mol. Mass.:
318.4139
SMILES:
COC(=O)[C@H](CCCCN)NC(C#N)[C@@H](N)Cc1ccccc1
: