Target
Lysosomal acid glucosylceramidase
Ligand
BDBM50283600
Substrate
Meas. Tech.
ChEMBL_215881 (CHEMBL820814)
IC50
7780±n/a nM
Citation
 Uchida, CKimura, HOgawa, S Potent glycosidase inhibitors, N-phenyl cyclic isourea derivatives of 5-amino- and 5-amino-1-C-(hydroxymethyl)-cyclopentane-1,2,3,4-tetraols Bioorg Med Chem Lett 4:2643-2648 (1994)    Article 
Target
Name:
Lysosomal acid glucosylceramidase
Synonyms:
Acid beta-glucosidase Beta-glucocerebrosidase D-glucosyl-N-acylsphingosine glucohydrolase GBA1 GC GLUC Glucosylceramidase (GBA) Glucosylceramidase precursor (Beta-glucocerebrosidase) (Acid beta-glucosidase) (D-glucosyl-N-acylsphingosine glucohydrolase) (Alglucerase) (Imiglucerase) beta-glucocerebrosidase (GCase)
Type:
Enzyme
Mol. Mass.:
59724.64
Organism:
Homo sapiens (Human)
Description:
The beta-Glu activity was measured with commercially available beta-glucocerebrosidase (Ceredase) as the enzyme source.
Residue:
536
  
Inhibitor
Name:
BDBM50283600
Synonyms:
5-Amino-cyclopentane-1,2,3,4-tetraol | CHEMBL87120
Type:
Small organic molecule
Emp. Form.:
C5H11NO4
Mol. Mass.:
149.1451
SMILES:
NC1C(O)C(O)C(O)C1O
: