Target
Lysosomal alpha-glucosidase
Ligand
BDBM50283600
Substrate
Meas. Tech.
ChEMBL_33932 (CHEMBL647267)
IC50
>300000±n/a nM
Citation
 Uchida, CKimura, HOgawa, S Potent glycosidase inhibitors, N-phenyl cyclic isourea derivatives of 5-amino- and 5-amino-1-C-(hydroxymethyl)-cyclopentane-1,2,3,4-tetraols Bioorg Med Chem Lett 4:2643-2648 (1994)    Article 
Target
Name:
Lysosomal alpha-glucosidase
Synonyms:
70 kDa lysosomal alpha-glucosidase Acid maltase Alpha glucosidase LYAG_HUMAN
Type:
PROTEIN
Mol. Mass.:
105312.45
Organism:
Homo sapiens (Human)
Description:
ChEMBL_1506060
Residue:
952
  
Inhibitor
Name:
BDBM50283600
Synonyms:
5-Amino-cyclopentane-1,2,3,4-tetraol | CHEMBL87120
Type:
Small organic molecule
Emp. Form.:
C5H11NO4
Mol. Mass.:
149.1451
SMILES:
NC1C(O)C(O)C(O)C1O
: