Target
Kappa-type opioid receptor
Ligand
BDBM50366351
Substrate
Meas. Tech.
ChEMBL_92409 (CHEMBL701403)
Ki
10±n/a nM
Citation
 Gottschlich, RAckermann, KBarber, ABartoszyk, GGreiner, H EMD 61 753 as a favourable representative of structurally novel arylacetamido-type K opiate receptor agonists Bioorg Med Chem Lett 4:677-682 (1994)    Article 
Target
Name:
Kappa-type opioid receptor
Synonyms:
Kappa Opioid Receptor OPRK1 Opiate Kappa 1 | mu/kappa opioid receptor
Type:
G Protein-Coupled Receptor (GPCR)
Mol. Mass.:
42744.99
Organism:
Cavia porcellus (domestic guinea pig)
Description:
P41144
Residue:
380
  
Inhibitor
Name:
BDBM50366351
Synonyms:
CHEMBL545346
Type:
Small organic molecule
Emp. Form.:
C27H36N2O2
Mol. Mass.:
420.5869
SMILES:
CN([C@H](CN1CC[C@H](O)C1)c1ccccc1)C(=O)C(C1CCCCC1)c1ccccc1
: