Target
Sodium-dependent serotonin transporter
Ligand
BDBM22416
Substrate
Meas. Tech.
ChEMBL_202300 (CHEMBL812553)
Ki
0.0770±n/a nM
Citation
 Meyer, MDHancock, AATietje, KSippy, kBGiardina, WJKerwin, JF Synthesis and pharmacological characterization of A-80426: A putative novel antidepressant combining -2 antagonism with 5-HT uptake inhibition Bioorg Med Chem Lett 5:2287-2292 (1995)    Article 
Target
Name:
Sodium-dependent serotonin transporter
Synonyms:
5-HT Transporter 5HTT SC6A4_HUMAN SLC6A4 Serotonin transporter (5HTT) Sodium-dependent serotonin transporter (SERT) | Solute carrier family 6 member 4
Type:
Multi-pass membrane protein
Mol. Mass.:
70322.51
Organism:
Homo sapiens (Human)
Description:
P31645
Residue:
630
  
Inhibitor
Name:
BDBM22416
Synonyms:
(3S,4R)-3-[(1,3-benzodioxol-5-yloxy)methyl]-4-(4-fluorophenyl)piperidine CHEMBL490 US09969700, Paroxetine [3H]Paroxetine
Type:
radiolabeled ligand
Emp. Form.:
C19H20FNO3
Mol. Mass.:
329.3654
SMILES:
Fc1ccc(cc1)[C@@H]1CCNC[C@H]1COc1ccc2OCOc2c1
: