Target
Cholecystokinin receptor type A
Ligand
BDBM50285625
Substrate
Meas. Tech.
ChEBML_40060
Ki
392±n/a nM
Citation
 Horwell, DHunter, JKneen, CPritchard, M Synthesis of novel iodinated radioligands with high affinity and selectivity for CCK-B/gastrin receptors Bioorg Med Chem Lett 5:2501-2506 (1995)    Article 
Target
Name:
Cholecystokinin receptor type A
Synonyms:
CCKAR_RAT Cholecystokinin peripheral Cholecystokinin receptor type A
Type:
Enzyme Catalytic Domain
Mol. Mass.:
49676.37
Organism:
RAT
Description:
Cholecystokinin central 0 RAT::P30551
Residue:
444
  
Inhibitor
Name:
BDBM50285625
Synonyms:
(R)-3-[(R)-2-(Adamantan-2-yloxycarbonylamino)-3-(1H-indol-3-yl)-2-methyl-propionylamino]-4-(4-azido-3-iodo-phenyl)-butyric acid CHEMBL312252 | PD-142251
Type:
Small organic molecule
Emp. Form.:
C33H37IN6O5
Mol. Mass.:
724.5885
SMILES:
C[C@](Cc1c[nH]c2ccccc12)(NC(=O)OC1C2CC3CC(C2)CC1C3)C(=O)N[C@@H](CC(O)=O)Cc1ccc(N=[N+]=[N-])c(I)c1
: