Target
Neprilysin
Ligand
BDBM50285641
Substrate
Meas. Tech.
ChEMBL_144462 (CHEMBL755109)
IC50
>100000±n/a nM
Citation
 Penning, TDAskonas, LJDjuric, SWHaack, RAYu, SSMichener, MLKrivi, GGPyla, E Kelatorphan and related analogs: potent and selective inhibitors of leukotriene A4 hydrolase Bioorg Med Chem Lett 5:2517-2522 (1995)    Article 
Target
Name:
Neprilysin
Synonyms:
Atriopeptidase CD_antigen=CD10 MME NEP_RABIT Neutral endopeptidase 24.11
Type:
Enzyme
Mol. Mass.:
85570.75
Organism:
Oryctolagus cuniculus (rabbit)
Description:
NEP was purified to homogeneity from rabbit kidney.
Residue:
750
  
Inhibitor
Name:
BDBM50285641
Synonyms:
(S)-2-((R)-2-Cyclohexylmethyl-4-mercapto-butyrylamino)-propionic acid | CHEMBL313284
Type:
Small organic molecule
Emp. Form.:
C14H25NO3S
Mol. Mass.:
287.418
SMILES:
C[C@H](NC(=O)[C@@H](CCS)CC1CCCCC1)C(O)=O
: