Target
Leukotriene A-4 hydrolase
Ligand
BDBM50285630
Substrate
Meas. Tech.
ChEMBL_96940 (CHEMBL706181)
IC50
10±n/a nM
Citation
 Penning, TDAskonas, LJDjuric, SWHaack, RAYu, SSMichener, MLKrivi, GGPyla, E Kelatorphan and related analogs: potent and selective inhibitors of leukotriene A4 hydrolase Bioorg Med Chem Lett 5:2517-2522 (1995)    Article 
Target
Name:
Leukotriene A-4 hydrolase
Synonyms:
LKHA4_HUMAN LTA4 Leukotriene A(4) hydrolase Leukotriene A4 hydrolase
Type:
Hydrolase; metalloprotease
Mol. Mass.:
69280.41
Organism:
Homo sapiens (Human)
Description:
Human recombinant LTA4H.
Residue:
611
  
Inhibitor
Name:
BDBM50285630
Synonyms:
(S)-2-((R)-2-Benzyl-3-hydroxycarbamoyl-propionylamino)-3-cyclohexyl-propionic acid | CHEMBL83291
Type:
Small organic molecule
Emp. Form.:
C20H28N2O5
Mol. Mass.:
376.4467
SMILES:
ONC(=O)C[C@@H](Cc1ccccc1)C(=O)N[C@@H](CC1CCCCC1)C(O)=O
: