Target
Leukotriene A-4 hydrolase
Ligand
BDBM50285635
Substrate
Meas. Tech.
ChEMBL_96940 (CHEMBL706181)
IC50
30±n/a nM
Citation
 Penning, TDAskonas, LJDjuric, SWHaack, RAYu, SSMichener, MLKrivi, GGPyla, E Kelatorphan and related analogs: potent and selective inhibitors of leukotriene A4 hydrolase Bioorg Med Chem Lett 5:2517-2522 (1995)    Article 
Target
Name:
Leukotriene A-4 hydrolase
Synonyms:
LKHA4_HUMAN LTA4 Leukotriene A(4) hydrolase Leukotriene A4 hydrolase
Type:
Hydrolase; metalloprotease
Mol. Mass.:
69280.41
Organism:
Homo sapiens (Human)
Description:
Human recombinant LTA4H.
Residue:
611
  
Inhibitor
Name:
BDBM50285635
Synonyms:
(S)-1-((R)-2-Benzyl-3-hydroxycarbamoyl-propionyl)-pyrrolidine-2-carboxylic acid | CHEMBL85512
Type:
Small organic molecule
Emp. Form.:
C16H20N2O5
Mol. Mass.:
320.3404
SMILES:
ONC(=O)C[C@@H](Cc1ccccc1)C(=O)N1CCC[C@H]1C(O)=O
: