Target
Lysosomal alpha-glucosidase
Ligand
BDBM50285809
Substrate
Meas. Tech.
ChEBML_37554
Ki
100000±n/a nM
Citation
 Bleriot, YDintinger, TGenre-Grandpierre, APadrines, MTellier, C Inhibition of glycosidases by substituted amidines Bioorg Med Chem Lett 5:2655-2660 (1995)    Article 
Target
Name:
Lysosomal alpha-glucosidase
Synonyms:
70 kDa lysosomal alpha-glucosidase Acid maltase Alpha glucosidase LYAG_HUMAN
Type:
PROTEIN
Mol. Mass.:
105312.45
Organism:
Homo sapiens (Human)
Description:
ChEMBL_1506060
Residue:
952
  
Inhibitor
Name:
BDBM50285809
Synonyms:
CHEMBL2368788
Type:
Small organic molecule
Emp. Form.:
C13H24N2O9
Mol. Mass.:
352.3377
SMILES:
CO[C@H]1O[C@@H](CNC2=N[C@@H](CO)[C@@H](O)[C@H](O)[C@@H]2O)[C@@H](O)[C@H](O)[C@H]1O
: