Target
5-hydroxytryptamine receptor 4
Ligand
BDBM82519
Substrate
Meas. Tech.
ChEBML_3342
Ki
48±n/a nM
Citation
 Langlois, MYang, DBremont, BShen, S Synthesis and pharmacological activity of a macrocyclic benzamide Bioorg Med Chem Lett 5:795-798 (1995)    Article 
Target
Name:
5-hydroxytryptamine receptor 4
Synonyms:
5-HT-4 5-HT4L 5-hydroxytryptamine receptor 4 Htr4 Serotonin 4 (5-HT4) receptor
Type:
Enzyme Catalytic Domain
Mol. Mass.:
46117.31
Organism:
RAT
Description:
5-HT4 HTR4 RAT::Q62758
Residue:
406
  
Inhibitor
Name:
BDBM82519
Synonyms:
4-amino-5-chloro-2-methoxy-N-(8-methyl-8-azabicyclo[3.2.1]octan-3-yl)benzamide CAS_76272-78-1
Type:
Small organic molecule
Emp. Form.:
C16H22ClN3O2
Mol. Mass.:
323.818
SMILES:
[H]C12CCC([H])(CC(C1)NC(=O)c1cc(Cl)c(N)cc1OC)N2C
: