Target
Neprilysin
Ligand
BDBM50286905
Substrate
Meas. Tech.
ChEBML_140877
IC50
2.80±n/a nM
Citation
 Kanno, HOsanai, KFurugohri, TWatanabe, Y Potent inhibitors of neutral endopeptidase. 2-Biphenyl- methylglutaric acid amide derivatives Bioorg Med Chem Lett 6:65-70 (1996)    Article 
Target
Name:
Neprilysin
Synonyms:
Mme Neprilysin Neutral endopeptidase 24.11
Type:
Protein
Mol. Mass.:
85789.59
Organism:
Rattus norvegicus (Rat)
Description:
P07861
Residue:
750
  
Inhibitor
Name:
BDBM50286905
Synonyms:
(S)-5-Biphenyl-4-yl-4-(1-carboxy-ethylcarbamoyl)-2-phenoxymethyl-pentanoic acid | CHEMBL159954
Type:
Small organic molecule
Emp. Form.:
C28H29NO6
Mol. Mass.:
475.533
SMILES:
CC(NC(=O)[C@@H](CC(COc1ccccc1)C(O)=O)Cc1ccc(cc1)-c1ccccc1)C(O)=O
: