Target
5-hydroxytryptamine receptor 4
Ligand
BDBM50105651
Substrate
Meas. Tech.
ChEBML_3320
Ki
719±n/a nM
Citation
 Lopez-Rodriguez, MLMorcillo, MJBenhamu, BRiaguas, MD Novel benzimidazole-4-carboxylic acid derivatives as potent and selective 5-HT3 receptor ligands Bioorg Med Chem Lett 6:1195-1198 (1996)    Article 
Target
Name:
5-hydroxytryptamine receptor 4
Synonyms:
5-HT-4 5-HT4L 5-hydroxytryptamine receptor 4 Htr4 Serotonin 4 (5-HT4) receptor
Type:
Enzyme Catalytic Domain
Mol. Mass.:
46117.31
Organism:
RAT
Description:
5-HT4 HTR4 RAT::Q62758
Residue:
406
  
Inhibitor
Name:
BDBM50105651
Synonyms:
1H-Benzoimidazole-4-carboxylic acid (1-methyl-piperidin-4-yl)-amide | CHEMBL18473
Type:
Small organic molecule
Emp. Form.:
C14H18N4O
Mol. Mass.:
258.3189
SMILES:
CN1CCC(CC1)NC(=O)c1cccc2nc[nH]c12
: