Target
5-hydroxytryptamine receptor 4
Ligand
BDBM50083179
Substrate
Meas. Tech.
ChEBML_3320
Ki
>10000±n/a nM
Citation
 Lopez-Rodriguez, MLMorcillo, MJBenhamu, BRiaguas, MD Novel benzimidazole-4-carboxylic acid derivatives as potent and selective 5-HT3 receptor ligands Bioorg Med Chem Lett 6:1195-1198 (1996)    Article 
Target
Name:
5-hydroxytryptamine receptor 4
Synonyms:
5-HT-4 5-HT4L 5-hydroxytryptamine receptor 4 Htr4 Serotonin 4 (5-HT4) receptor
Type:
Enzyme Catalytic Domain
Mol. Mass.:
46117.31
Organism:
RAT
Description:
5-HT4 HTR4 RAT::Q62758
Residue:
406
  
Inhibitor
Name:
BDBM50083179
Synonyms:
1H-Benzoimidazole-4-carboxylic acid 1-aza-bicyclo[2.2.2]oct-3-yl ester | CHEMBL275356
Type:
Small organic molecule
Emp. Form.:
C15H17N3O2
Mol. Mass.:
271.3144
SMILES:
O=C(OC1CN2CCC1CC2)c1cccc2nc[nH]c12
: