Target
Glutamate--cysteine ligase catalytic subunit
Ligand
BDBM50366432
Substrate
Meas. Tech.
ChEMBL_68754 (CHEMBL681831)
Ki
390±n/a nM
Citation
 Katoh, MHiratake, JKato, HOda, J Mechanism-based inactivation of E. coli -glutamylcysteine synthetase by phosphinic acid- and sulfoximine-based transition-state analogues Bioorg Med Chem Lett 6:1437-1442 (1996)    Article 
Target
Name:
Glutamate--cysteine ligase catalytic subunit
Synonyms:
GCLC GLCLC Gamma-glutamylcysteine synthetase
Type:
PROTEIN
Mol. Mass.:
72759.43
Organism:
Homo sapiens (Human)
Description:
ChEMBL_68753
Residue:
637
  
Inhibitor
Name:
BDBM50366432
Synonyms:
CHEMBL1627263
Type:
Small organic molecule
Emp. Form.:
C9H16N2O5S
Mol. Mass.:
264.299
SMILES:
CCC(CS(=N)(=O)CCC(=N)C(O)=O)C(O)=O
: