Target
Retinoic acid receptor alpha
Ligand
BDBM50290081
Substrate
Meas. Tech.
ChEBML_197414
Ki
487±n/a nM
Citation
 Diaz, PMichel, SStella, LCharpentier, B Synthesis and biological activities of new heterocyclic aromatic retinoids Bioorg Med Chem Lett 7:2289-2294 (1997)    Article 
Target
Name:
Retinoic acid receptor alpha
Synonyms:
NR1B1 RAR-alpha RARA_HUMAN Retinoic acid receptor alpha/Retinoid X receptor alpha Retinoid receptor
Type:
PROTEIN
Mol. Mass.:
50778.87
Organism:
Homo sapiens (Human)
Description:
ChEMBL_1466191
Residue:
462
  
Inhibitor
Name:
BDBM50290081
Synonyms:
3-(5,5,8,8-Tetramethyl-5,6,7,8-tetrahydro-naphthalen-2-yl)-2H-chromene-7-carboxylic acid | CHEMBL75848
Type:
Small organic molecule
Emp. Form.:
C24H26O3
Mol. Mass.:
362.4614
SMILES:
CC1(C)CCC(C)(C)c2cc(ccc12)C1=Cc2ccc(cc2OC1)C(O)=O
: