Target
Retinoic acid receptor alpha
Ligand
BDBM50290082
Substrate
Meas. Tech.
ChEBML_197414
Ki
764±n/a nM
Citation
 Diaz, PMichel, SStella, LCharpentier, B Synthesis and biological activities of new heterocyclic aromatic retinoids Bioorg Med Chem Lett 7:2289-2294 (1997)    Article 
Target
Name:
Retinoic acid receptor alpha
Synonyms:
NR1B1 RAR-alpha RARA_HUMAN Retinoic acid receptor alpha/Retinoid X receptor alpha Retinoid receptor
Type:
PROTEIN
Mol. Mass.:
50778.87
Organism:
Homo sapiens (Human)
Description:
ChEMBL_1466191
Residue:
462
  
Inhibitor
Name:
BDBM50290082
Synonyms:
3-(3-Adamantan-1-yl-4-methoxy-phenyl)-2H-chromene-7-carboxylic acid | CHEMBL75732
Type:
Small organic molecule
Emp. Form.:
C27H28O4
Mol. Mass.:
416.5088
SMILES:
COc1ccc(cc1C12C[C@H]3C[C@H](C[C@H](C3)C1)C2)C1=Cc2ccc(cc2OC1)C(O)=O
: