Target
Serine protease 1
Ligand
BDBM50291171
Substrate
Meas. Tech.
ChEBML_212354
IC50
230±n/a nM
Citation
 Akiyama, YTsutsumi, SHatsushiba, EOhuchi, SOkonogi, T Peptidyl -keto thiazole as potent thrombin inhibitors Bioorg Med Chem Lett 7:533-538 (1997)    Article 
Target
Name:
Serine protease 1
Synonyms:
Beta-Trypsin PRSS1 TRY1 TRYP1 Trypsin I
Type:
Enzyme
Mol. Mass.:
25790.52
Organism:
Bos taurus (bovine)
Description:
P00760
Residue:
246
  
Inhibitor
Name:
BDBM50291171
Synonyms:
(S)-1-(4-Phenyl-butyryl)-pyrrolidine-2-carboxylic acid [(S)-4-guanidino-1-(thiazole-2-carbonyl)-butyl]-amide | CHEMBL151379
Type:
Small organic molecule
Emp. Form.:
C24H32N6O3S
Mol. Mass.:
484.614
SMILES:
NC(=N)NCCC[C@H](NC(=O)[C@@H]1CCCN1C(=O)CCCc1ccccc1)C(=O)c1nccs1
: