Target
Cholecystokinin receptor type A
Ligand
BDBM50011197
Substrate
Meas. Tech.
ChEBML_49716
IC50
4000±n/a nM
Citation
 Herrero, SSuarez-Gea, MGonzalez-Muniz, RGarcia-Lopez, MHerranz, RBallaz, SBarber, AFortuno, ADel Rio, J Pseudopeptide CCK-4 analogues incorporating the [CH(CN)NH] peptide bond surrogate Bioorg Med Chem Lett 7:855-860 (1997)    Article 
Target
Name:
Cholecystokinin receptor type A
Synonyms:
CCK-A receptor CCK1-R CCKAR_CAVPO Cholecystokinin receptor type A | Cholecystokinin-1 receptor
Type:
Mol. Mass.:
48229.77
Organism:
Cavia porcellus
Description:
Residue:
430
  
Inhibitor
Name:
BDBM50011197
Synonyms:
3-{2-[2-tert-Butoxycarbonylamino-3-(1H-indol-3-yl)-propionylamino]-hexanoylamino}-N-(1-carbamoyl-2-phenyl-ethyl)-succinamic acid | CHEMBL169054
Type:
Small organic molecule
Emp. Form.:
C35H46N6O8
Mol. Mass.:
678.7751
SMILES:
CCCC[C@H](NC(=O)[C@H](Cc1c[nH]c2ccccc12)NC(=O)OC(C)(C)C)C(=O)N[C@@H](CC(O)=O)C(=O)N[C@@H](Cc1ccccc1)C(N)=O
: