Target
Cholecystokinin receptor type A
Ligand
BDBM50291430
Substrate
Meas. Tech.
ChEBML_50195
IC50
5220±n/a nM
Citation
 Herrero, SSuarez-Gea, MGonzalez-Muniz, RGarcia-Lopez, MHerranz, RBallaz, SBarber, AFortuno, ADel Rio, J Pseudopeptide CCK-4 analogues incorporating the [CH(CN)NH] peptide bond surrogate Bioorg Med Chem Lett 7:855-860 (1997)    Article 
Target
Name:
Cholecystokinin receptor type A
Synonyms:
CCKAR_RAT Cholecystokinin peripheral Cholecystokinin receptor type A
Type:
Enzyme Catalytic Domain
Mol. Mass.:
49676.37
Organism:
RAT
Description:
Cholecystokinin central 0 RAT::P30551
Residue:
444
  
Inhibitor
Name:
BDBM50291430
Synonyms:
CHEMBL354817 | [(1S,2R)-2-((S)-1-Carbamoyl-2-phenyl-ethylamino)-2-cyano-1-(1H-indol-3-ylmethyl)-ethyl]-carbamic acid benzyl ester
Type:
Small organic molecule
Emp. Form.:
C29H29N5O3
Mol. Mass.:
495.5723
SMILES:
NC(=O)[C@H](Cc1ccccc1)N[C@@H](C#N)[C@H](Cc1c[nH]c2ccccc12)NC(=O)OCc1ccccc1
: