Target
Gastrin/cholecystokinin type B receptor
Ligand
BDBM50291424
Substrate
Meas. Tech.
ChEBML_48595
IC50
953±n/a nM
Citation
 Herrero, SSuarez-Gea, MGonzalez-Muniz, RGarcia-Lopez, MHerranz, RBallaz, SBarber, AFortuno, ADel Rio, J Pseudopeptide CCK-4 analogues incorporating the [CH(CN)NH] peptide bond surrogate Bioorg Med Chem Lett 7:855-860 (1997)    Article 
Target
Name:
Gastrin/cholecystokinin type B receptor
Synonyms:
Cckbr Cholecystokinin B receptor GASR_RAT | Gastrin/cholecystokinin type B receptor
Type:
Enzyme Catalytic Domain
Mol. Mass.:
48980.43
Organism:
RAT
Description:
Cholecystokinin A CCKBR RAT::P30553
Residue:
452
  
Inhibitor
Name:
BDBM50291424
Synonyms:
(S)-3-{(S)-2-[(1R,2S)-2-Benzyloxycarbonylamino-1-cyano-3-(1H-indol-3-yl)-propylamino]-hexanoylamino}-N-((S)-1-carbamoyl-2-phenyl-ethyl)-succinamic acid | CHEMBL168435
Type:
Small organic molecule
Emp. Form.:
C39H45N7O7
Mol. Mass.:
723.8173
SMILES:
CCCC[C@H](N[C@@H](C#N)[C@H](Cc1c[nH]c2ccccc12)NC(=O)OCc1ccccc1)C(=O)N[C@@H](CC(O)=O)C(=O)N[C@@H](Cc1ccccc1)C(N)=O
: