Target
Metabotropic glutamate receptor 5
Ligand
BDBM50071161
Substrate
Meas. Tech.
ChEMBL_106719 (CHEMBL715725)
IC50
>300000±n/a nM
Citation
 Valli, MJSchoepp, DDWright, RAJohnson, BGKingston, AETomlinson, RMonn, JA Synthesis and metabotropic glutamate receptor antagonist activity of N1-substituted analogs of 2R,4R-4-aminopyrrolidine-2,4-dicarboxylic acid. Bioorg Med Chem Lett 8:1985-90 (1999)  
Target
Name:
Metabotropic glutamate receptor 5
Synonyms:
GPRC1E GRM5_HUMAN metabotropic glutamate 5 | metabotropic glutamate 5a
Type:
Enzyme
Mol. Mass.:
132484.72
Organism:
Homo sapiens (Human)
Description:
Residue:
1212
  
Inhibitor
Name:
BDBM50071161
Synonyms:
(2R,4R)-4-Amino-1-benzyl-pyrrolidine-2,4-dicarboxylic acid CHEMBL60238
Type:
Small organic molecule
Emp. Form.:
C13H16N2O4
Mol. Mass.:
264.2771
SMILES:
N[C@@]1(C[C@@H](N(Cc2ccccc2)C1)C(O)=O)C(O)=O
: