Target
Metabotropic glutamate receptor 4
Ligand
BDBM50071151
Substrate
Meas. Tech.
ChEBML_106554
IC50
>300000±n/a nM
Citation
 Valli, MJSchoepp, DDWright, RAJohnson, BGKingston, AETomlinson, RMonn, JA Synthesis and metabotropic glutamate receptor antagonist activity of N1-substituted analogs of 2R,4R-4-aminopyrrolidine-2,4-dicarboxylic acid. Bioorg Med Chem Lett 8:1985-90 (1999)  
Target
Name:
Metabotropic glutamate receptor 4
Synonyms:
GPRC1D GRM4_HUMAN MGLUR4 Metabotropic glutamate receptor 4 (mGlu4) metabotropic glutamate 4
Type:
Protein
Mol. Mass.:
101899.95
Organism:
Homo sapiens (Human)
Description:
Q14833
Residue:
912
  
Inhibitor
Name:
BDBM50071151
Synonyms:
(2R,4R)-4-Amino-1-(2,2-diphenyl-ethyl)-pyrrolidine-2,4-dicarboxylic acid | CHEMBL304919
Type:
Small organic molecule
Emp. Form.:
C20H22N2O4
Mol. Mass.:
354.3997
SMILES:
N[C@@]1(C[C@@H](N(CC(c2ccccc2)c2ccccc2)C1)C(O)=O)C(O)=O
: