Target
Metabotropic glutamate receptor 8
Ligand
BDBM50071167
Substrate
Meas. Tech.
ChEBML_104489
IC50
>300000±n/a nM
Citation
 Valli, MJSchoepp, DDWright, RAJohnson, BGKingston, AETomlinson, RMonn, JA Synthesis and metabotropic glutamate receptor antagonist activity of N1-substituted analogs of 2R,4R-4-aminopyrrolidine-2,4-dicarboxylic acid. Bioorg Med Chem Lett 8:1985-90 (1999)  
Target
Name:
Metabotropic glutamate receptor 8
Synonyms:
GPRC1H GRM8_HUMAN Metabotropic glutamate receptor 8 | metabotropic glutamate 8
Type:
Enzyme Catalytic Domain
Mol. Mass.:
101759.58
Organism:
Homo sapiens (Human)
Description:
metabotropic glutamate 8 GRM8 HUMAN::O00222
Residue:
908
  
Inhibitor
Name:
BDBM50071167
Synonyms:
(2R,4R)-4-Amino-1-(2,6-dichloro-benzyl)-pyrrolidine-2,4-dicarboxylic acid | CHEMBL60164
Type:
Small organic molecule
Emp. Form.:
C13H14Cl2N2O4
Mol. Mass.:
333.167
SMILES:
N[C@@]1(C[C@@H](N(Cc2c(Cl)cccc2Cl)C1)C(O)=O)C(O)=O
: