Target
Muscarinic acetylcholine receptor M1
Ligand
BDBM50216130
Substrate
Meas. Tech.
ChEMBL_139527 (CHEMBL748283)
IC50
25±n/a nM
Citation
 Augelli-Szafran, CEJaen, JCMoreland, DWNelson, CBPenvose-Yi, JRSchwarz, RD Identification and characterization of m4 selective muscarinic antagonists. Bioorg Med Chem Lett 8:1991-6 (1999)  
Target
Name:
Muscarinic acetylcholine receptor M1
Synonyms:
ACM1_HUMAN Cholinergic receptor, muscarinic 1 | Cholinergic, muscarinic M1
Type:
Protein
Mol. Mass.:
51442.54
Organism:
Homo sapiens (Human)
Description:
P11229
Residue:
460
  
Inhibitor
Name:
BDBM50216130
Synonyms:
CHEMBL3349343
Type:
Small organic molecule
Emp. Form.:
C25H29IN2O4
Mol. Mass.:
548.4132
SMILES:
[I-].CCOC(=O)C1=C(C)[N+](C)(C)c2ccc3OC4N(CCc5cc(OC)ccc45)Cc3c12
: