Target
Muscarinic acetylcholine receptor M3
Ligand
BDBM50071176
Substrate
Meas. Tech.
ChEBML_139673
IC50
12612±n/a nM
Citation
 Augelli-Szafran, CEJaen, JCMoreland, DWNelson, CBPenvose-Yi, JRSchwarz, RD Identification and characterization of m4 selective muscarinic antagonists. Bioorg Med Chem Lett 8:1991-6 (1999)  
Target
Name:
Muscarinic acetylcholine receptor M3
Synonyms:
ACM3_HUMAN Cholinergic, muscarinic M3 Muscarinic receptor M3 | RecName: Full=Muscarinic acetylcholine receptor M3
Type:
Enzyme
Mol. Mass.:
66151.03
Organism:
Homo sapiens (Human)
Description:
P20309
Residue:
590
  
Inhibitor
Name:
BDBM50071176
Synonyms:
2-Methyl-11,12-dihydro-3H,6aH,13H-6-oxa-3,12a-diaza-benzo[a]cyclopenta[h]anthracene-1-carboxylic acid methyl ester | CHEMBL61774
Type:
Small organic molecule
Emp. Form.:
C21H20N2O3
Mol. Mass.:
348.3951
SMILES:
COC(=O)c1c(C)[nH]c2ccc3OC4N(CCc5ccccc45)Cc3c12
: