Target
Delta-type opioid receptor
Ligand
BDBM50450656
Substrate
Meas. Tech.
ChEMBL_146754 (CHEMBL753334)
IC50
0.010000±n/a nM
Citation
 Horikawa, MShigeri, YYumoto, NYoshikawa, SNakajima, TOhfune, Y Syntheses of potent Leu-enkephalin analogs possessing beta-hydroxy-alpha,alpha-disubstituted-alpha-amino acid and their characterization to opioid receptors. Bioorg Med Chem Lett 8:2027-32 (1999)  
Target
Name:
Delta-type opioid receptor
Synonyms:
Cytochrome P450 3A4 Delta opioid receptor Delta-type opioid receptor (DOR) OPRD_RAT Opioid receptor Opioid receptors; mu & delta Ror-a | Voltage-gated potassium channel
Type:
G Protein-Coupled Receptor (GPCR)
Mol. Mass.:
40465.04
Organism:
Rattus norvegicus (rat)
Description:
Competition binding assays were using CHO-K1 cell membranes expressing the opioid receptor.
Residue:
372
  
Inhibitor
Name:
BDBM50450656
Synonyms:
CHEMBL2114469
Type:
Small organic molecule
Emp. Form.:
C32H43N5O8
Mol. Mass.:
625.7125
SMILES:
CC(C)C[C@@H](NC(=O)[C@@H](Cc1ccccc1)NC(=O)CNC(=O)[C@]1(CCC[C@@H]1O)NC(=O)[C@H](N)Cc1ccc(O)cc1)C(O)=O
: