Target
Gastrin-releasing peptide receptor
Ligand
BDBM50071738
Substrate
Meas. Tech.
ChEBML_39763
Ki
32±n/a nM
Citation
 Ashwood, VBrownhill, VHigginbottom, MHorwell, DCHughes, JLewthwaite, RAMcKnight, ATPinnock, RDPritchard, MCSuman-Chauhan, NWebb, CWilliams, SC PD 176252--the first high affinity non-peptide gastrin-releasing peptide (BB2) receptor antagonist. Bioorg Med Chem Lett 8:2589-94 (1999)  
Target
Name:
Gastrin-releasing peptide receptor
Synonyms:
Bombesin 2 GRP-preferring bombesin receptor GRPR_HUMAN Gastrin-releasing peptide receptor
Type:
Enzyme Catalytic Domain
Mol. Mass.:
43214.53
Organism:
Homo sapiens (Human)
Description:
Bombesin 2 GRPR 0::P30550
Residue:
384
  
Inhibitor
Name:
BDBM50071738
Synonyms:
(S)-N-[1-(4-Hydroxy-phenyl)-cyclohexylmethyl]-3-(1H-indol-3-yl)-2-methyl-2-[3-(4-nitro-phenyl)-ureido]-propionamide | CHEMBL87846
Type:
Small organic molecule
Emp. Form.:
C32H35N5O5
Mol. Mass.:
569.6508
SMILES:
C[C@@](Cc1c[nH]c2ccccc12)(NC(=O)Nc1ccc(cc1)[N+]([O-])=O)C(=O)NCC1(CCCCC1)c1ccc(O)cc1
: