Target
Mu-type opioid receptor
Ligand
BDBM50071864
Substrate
Meas. Tech.
ChEBML_221936
EC50
18±n/a nM
Citation
 Wang, CMcFadyen, IJTraynor, JRMosberg, HI Design of a high affinity peptidomimetic opioid agonist from peptide pharmacophore models. Bioorg Med Chem Lett 8:2685-8 (1999)  
Target
Name:
Mu-type opioid receptor
Synonyms:
MOR-1 Mu-type opioid receptor (MOR) OPRM_RAT Opioid receptor B Ror-b
Type:
G Protein-Coupled Receptor (GPCR)
Mol. Mass.:
44503.11
Organism:
Rattus norvegicus (rat)
Description:
Competition binding assays were carried out using membrane preparations from transfected HN9.10 cells that constitutively expressed the mu opioid receptor.
Residue:
398
  
Inhibitor
Name:
BDBM50071864
Synonyms:
10-[2-Amino-3-(4-hydroxy-phenyl)-propionylamino]-7-benzyl-3,3-dimethyl-6,9-dioxo-1,2-dithia-5,8-diaza-cycloundecane-4-carboxylic acid amide | CHEMBL2370163
Type:
Small organic molecule
Emp. Form.:
C26H33N5O5S2
Mol. Mass.:
559.701
SMILES:
CC1(C)SSC[C@@H](NC(=O)[C@@H](N)Cc2ccc(O)cc2)C(=O)N[C@@H](Cc2ccccc2)C(=O)N[C@@H]1C(N)=O
: