Target
Muscarinic acetylcholine receptor M1
Ligand
BDBM50072227
Substrate
Meas. Tech.
ChEBML_139523
EC50
0.500000±n/a nM
Citation
 Sauerberg, PJeppesen, LOlesen, PHSheardown, MJFink-Jensen, ARasmussen, TRimvall, KShannon, HEBymaster, FPDeLapp, NWCalligaro, DOWard, JSWhitesitt, CAThomsen, C Identification of side chains on 1,2,5-thiadiazole-azacycles optimal for muscarinic m1 receptor activation. Bioorg Med Chem Lett 8:2897-902 (1999)  
Target
Name:
Muscarinic acetylcholine receptor M1
Synonyms:
ACM1_HUMAN Cholinergic receptor, muscarinic 1 | Cholinergic, muscarinic M1
Type:
Protein
Mol. Mass.:
51442.54
Organism:
Homo sapiens (Human)
Description:
P11229
Residue:
460
  
Inhibitor
Name:
BDBM50072227
Synonyms:
(1R,5R,6R)-6-[4-(3-Phenyl-prop-2-ynyloxy)-[1,2,5]thiadiazol-3-yl]-1-aza-bicyclo[3.2.1]octane | CHEMBL98255
Type:
Small organic molecule
Emp. Form.:
C18H19N3OS
Mol. Mass.:
325.428
SMILES:
C(Oc1nsnc1[C@H]1C[N@]2C[C@@H]1CCC2)C#Cc1ccccc1
: