Target
Receptor-type tyrosine-protein phosphatase C
Ligand
BDBM50069998
Substrate
Meas. Tech.
ChEMBL_39937 (CHEMBL655778)
Ki
9000±n/a nM
Citation
 Wang, QHuang, ZRamachandran, CDinaut, ANTaylor, SD Naphthalenebis[alpha,alpha-difluoromethylenephosphonates] as potent inhibitors of protein tyrosine phosphatases. Bioorg Med Chem Lett 8:345-50 (1999)  
Target
Name:
Receptor-type tyrosine-protein phosphatase C
Synonyms:
CD45 L-CA PTPRC Receptor-type tyrosine-protein phosphatase C (CD45) | T200
Type:
Protein
Mol. Mass.:
147474.19
Organism:
Homo sapiens (Human)
Description:
P08575
Residue:
1306
  
Inhibitor
Name:
BDBM50069998
Synonyms:
Ammonium; [7-(difluoro-phosphono-methyl)-naphthalen-1-yl]-difluoro-methanephosphonate | CHEMBL419592
Type:
Small organic molecule
Emp. Form.:
C12H9F4O6P2
Mol. Mass.:
387.1379
SMILES:
OP(O)(=O)C(F)(F)c1ccc2cccc(c2c1)C(F)(F)P(O)([O-])=O
: