Target
Beta-mannosidase
Ligand
BDBM50070029
Substrate
Meas. Tech.
ChEBML_41367
Ki
25±n/a nM
Citation
 Therisod, HLetourneux, YTherisod, M A new strong inhibitor of beta-mannosidase. Bioorg Med Chem Lett 8:371-2 (1999)  
Target
Name:
Beta-mannosidase
Synonyms:
Lysosomal beta A mannosidase MANBA Mannanase | Mannase
Type:
PROTEIN
Mol. Mass.:
100878.33
Organism:
Homo sapiens (Human)
Description:
ChEMBL_41367
Residue:
879
  
Inhibitor
Name:
BDBM50070029
Synonyms:
(2Z)-3,4,5-trihydroxy-6-(hydroxymethyl)tetrahydro-2H-pyran-2-one O-(anilinocarbonyl)oxime | CHEMBL62552
Type:
Small organic molecule
Emp. Form.:
C13H16N2O7
Mol. Mass.:
312.2753
SMILES:
OCC1OC(=NOC(=O)Nc2ccccc2)C(O)C(O)C1O
: