Target
Lysosomal acid glucosylceramidase
Ligand
BDBM50070029
Substrate
Meas. Tech.
ChEBML_37571
Ki
2500±n/a nM
Citation
 Therisod, HLetourneux, YTherisod, M A new strong inhibitor of beta-mannosidase. Bioorg Med Chem Lett 8:371-2 (1999)  
Target
Name:
Lysosomal acid glucosylceramidase
Synonyms:
Acid beta-glucosidase Beta-glucocerebrosidase D-glucosyl-N-acylsphingosine glucohydrolase GBA1 GC GLUC Glucosylceramidase (GBA) Glucosylceramidase precursor (Beta-glucocerebrosidase) (Acid beta-glucosidase) (D-glucosyl-N-acylsphingosine glucohydrolase) (Alglucerase) (Imiglucerase) beta-glucocerebrosidase (GCase)
Type:
Enzyme
Mol. Mass.:
59724.64
Organism:
Homo sapiens (Human)
Description:
The beta-Glu activity was measured with commercially available beta-glucocerebrosidase (Ceredase) as the enzyme source.
Residue:
536
  
Inhibitor
Name:
BDBM50070029
Synonyms:
(2Z)-3,4,5-trihydroxy-6-(hydroxymethyl)tetrahydro-2H-pyran-2-one O-(anilinocarbonyl)oxime | CHEMBL62552
Type:
Small organic molecule
Emp. Form.:
C13H16N2O7
Mol. Mass.:
312.2753
SMILES:
OCC1OC(=NOC(=O)Nc2ccccc2)C(O)C(O)C1O
: