Target
Macrophage metalloelastase
Ligand
BDBM13123
Substrate
Meas. Tech.
ChEBML_103854
IC50
31±n/a nM
Citation
 Jeng, AYChou, MParker, DT Sulfonamide-based hydroxamic acids as potent inhibitors of mouse macrophage metalloelastase. Bioorg Med Chem Lett 8:897-902 (1999)  
Target
Name:
Macrophage metalloelastase
Synonyms:
MMP12_MOUSE Mme Mmp12
Type:
PROTEIN
Mol. Mass.:
54988.61
Organism:
Mus musculus
Description:
ChEMBL_796155
Residue:
473
  
Inhibitor
Name:
BDBM13123
Synonyms:
(2R)-2-[benzyl(4-methoxybenzene)sulfonamido]-N-hydroxy-2-phenylacetamide CHEMBL82827
Type:
Small organic molecule
Emp. Form.:
C22H22N2O5S
Mol. Mass.:
426.485
SMILES:
COc1ccc(cc1)S(=O)(=O)N(Cc1ccccc1)[C@@H](C(=O)NO)c1ccccc1
: