Target
Glycogen phosphorylase, muscle form
Ligand
BDBM50215446
Substrate
Meas. Tech.
ChEMBL_138468 (CHEMBL745186)
Ki
26000±n/a nM
Citation
 Osz, ESomsák, LSzilágyi, LKovács, LDocsa, TTóth, BGergely, P Efficient inhibition of muscle and liver glycogen phosphorylases by a new glucopyranosylidene-spiro-thiohydantoin. Bioorg Med Chem Lett 9:1385-90 (1999)  
Target
Name:
Glycogen phosphorylase, muscle form
Synonyms:
Glycogen phosphorylase, muscle form Myophosphorylase PYGM_HUMAN
Type:
PROTEIN
Mol. Mass.:
97097.45
Organism:
Homo sapiens (Human)
Description:
ChEMBL_1449751
Residue:
842
  
Inhibitor
Name:
BDBM50215446
Synonyms:
CHEMBL3351144
Type:
Small organic molecule
Emp. Form.:
C8H12N2O7
Mol. Mass.:
248.1901
SMILES:
OC[C@@H]1O[C@@]2(NC(=O)NC2=O)[C@@H](O)[C@@H](O)[C@@H]1O
: