Target
Glutamyl aminopeptidase
Ligand
BDBM50078120
Substrate
Meas. Tech.
ChEMBL_32826 (CHEMBL646477)
Ki
0.000±n/a nM
Comments
Zero 01/04/22
Citation
 Chen, HRoques, BPFournié-Zaluski, MC Design of the first highly potent and selective aminopeptidase N (EC 3.4.11.2) inhibitor. Bioorg Med Chem Lett 9:1511-6 (1999)  
Target
Name:
Glutamyl aminopeptidase
Synonyms:
AMPE_PIG Aminopeptidase A EAP Glutamyl aminopeptidase
Type:
PROTEIN
Mol. Mass.:
108259.08
Organism:
Sus scrofa
Description:
ChEMBL_32826
Residue:
942
  
Inhibitor
Name:
BDBM50078120
Synonyms:
(R)-1-{[(S)-2-((S)-1-Carboxy-1-methyl-2-phenyl-ethylcarbamoyl)-3-phenyl-propyl]-hydroxy-phosphinoyl}-ethyl-ammonium
Type:
Small organic molecule
Emp. Form.:
C22H30N2O5P
Mol. Mass.:
433.4572
SMILES:
C[C@H]([NH3+])P(O)(=O)C[C@@H](Cc1ccccc1)C(=O)N[C@@](C)(Cc1ccccc1)C(O)=O
: