Target
Mu-type opioid receptor
Ligand
BDBM21130
Substrate
Meas. Tech.
ChEMBL_138734 (CHEMBL747756)
Kd
684±n/a nM
Citation
 Thomas, JBAtkinson, RNHerault, XMRothman, RBMascarella, SWDersch, CMXu, HHorel, RBCarroll, FI Optically pure (-)-4-[(N-allyl-3-methyl-4-piperidinyl)phenyl-amino]-N,N-diethylbenzami de displays selective binding and full agonist activity for the delta opioid receptor. Bioorg Med Chem Lett 9:3347-50 (2000)  
Target
Name:
Mu-type opioid receptor
Synonyms:
M-OR-1 Mu opioid receptor OPIATE Mu OPRM_CAVPO
Type:
Enzyme Catalytic Domain
Mol. Mass.:
11165.58
Organism:
GUINEA PIG
Description:
P97266
Residue:
98
  
Inhibitor
Name:
BDBM21130
Synonyms:
N-methyl-2-phenyl-N-[(5R,7S,8S)-7-(pyrrolidin-1-yl)-1-oxaspiro[4.5]decan-8-yl]acetamide U-69593 [3H]U69593
Type:
radiolabeled ligand
Emp. Form.:
C22H32N2O2
Mol. Mass.:
356.5017
SMILES:
CN([C@H]1CC[C@@]2(CCCO2)C[C@@H]1N1CCCC1)C(=O)Cc1ccccc1
: