Target
Vasopressin V2 receptor
Ligand
BDBM50403723
Substrate
Meas. Tech.
ChEBML_215014
Kd
2290±n/a nM
Citation
 Tóth, GKBakos, KPenke, BPávó, IVarga, CTörök, GPéter, AFülöp, F Synthesis of oxytocin antagonists containing conformationally constrained amino acids in position 2. Bioorg Med Chem Lett 9:667-72 (1999)  
Target
Name:
Vasopressin V2 receptor
Synonyms:
AVPR V2 Avpr2 V2R_RAT Vasopressin receptor
Type:
G-protein coupled receptor
Mol. Mass.:
40761.85
Organism:
Rattus norvegicus (Rat)
Description:
Residue:
371
  
Inhibitor
Name:
BDBM50403723
Synonyms:
CHEMBL2110163
Type:
Small organic molecule
Emp. Form.:
C43H66N14O11S2
Mol. Mass.:
1019.201
SMILES:
CC[C@H](C)[C@H]1NC(=O)[C@@]2(CCc3ccccc3C2)NC(=O)CCSSC[C@@H](NC(=O)[C@@H](CC(N)=O)NC(=O)[C@H](CCC(N)=O)NC1=O)C(=O)N(C)CC(=O)N[C@@H](CCCNC(N)=N)C(=O)NCC(N)=O
: