Target
Adenosine receptor A1
Ligand
BDBM50451006
Substrate
Meas. Tech.
ChEBML_29593
EC50
1±n/a nM
Citation
 Hutchinson, SABaker, SPScammells, PJ Adenosine receptor ligands with oxygenated N6-substituents. Bioorg Med Chem Lett 9:933-6 (1999)  
Target
Name:
Adenosine receptor A1
Synonyms:
A1 adenosine receptor (hA1) AA1R_HUMAN ADORA1 Adenosine A1-receptor Adenosine receptor A1 (hA1) | Adenosine transporter (AdT)
Type:
G Protein-Coupled Receptor (GPCR)
Mol. Mass.:
36520.92
Organism:
Homo sapiens (Human)
Description:
P30542
Residue:
326
  
Inhibitor
Name:
BDBM50451006
Synonyms:
CHEMBL2112185
Type:
Small organic molecule
Emp. Form.:
C17H21N5O5
Mol. Mass.:
375.3791
SMILES:
[H][C@]12O[C@@]1([H])C1CC2CC1Nc1ncnc2n(cnc12)[C@H]1O[C@@H](CO)[C@H](O)[C@@H]1O
: