Target
Androgen receptor
Ligand
BDBM18190
Substrate
Meas. Tech.
ChEMBL_36272 (CHEMBL648839)
Ki
7±n/a nM
Citation
 Higuchi, RIEdwards, JPCaferro, TRRinggenberg, JDKong, JWHamann, LGArienti, KLMarschke, KBDavis, RLFarmer, LJJones, TK 4-Alkyl- and 3,4-dialkyl-1,2,3,4-tetrahydro-8-pyridono[5,6-g]quinolines: potent, nonsteroidal androgen receptor agonists. Bioorg Med Chem Lett 9:1335-40 (1999)  
Target
Name:
Androgen receptor
Synonyms:
ANDR_HUMAN Androgen Receptor Androgen receptor/Baculoviral IAP repeat-containing protein 2 Dihydrotestosterone receptor Nuclear receptor subfamily 3 group C member 4
Type:
Receptor
Mol. Mass.:
99185.27
Organism:
Homo sapiens (Human)
Description:
CHO cells were stably transfected with human AR gene.
Residue:
920
  
Inhibitor
Name:
BDBM18190
Synonyms:
6-ethyl-4-(trifluoromethyl)-1H,2H,6H,7H,8H,9H-pyrido[3,2-g]quinolin-2-one Compound 3c | LG121071
Type:
Small organic molecule
Emp. Form.:
C15H15F3N2O
Mol. Mass.:
296.2876
SMILES:
CCC1CCNc2cc3[nH]c(=O)cc(c3cc12)C(F)(F)F
: