Target
Carbonic anhydrase 2
Ligand
BDBM50079047
Substrate
Meas. Tech.
ChEBML_45239
Ki
240±n/a nM
Citation
 Scozzafava, ASupuran, CT Carbonic anhydrase inhibitors: synthesis of N-morpholylthiocarbonylsulfenylamino aromatic/heterocyclic sulfonamides and their interaction with isozymes I, II and IV. Bioorg Med Chem Lett 10:1117-20 (2000)  
Target
Name:
Carbonic anhydrase 2
Synonyms:
CA-II CAC Carbonate dehydratase II Carbonic anhydrase 2 (CA-II) Carbonic anhydrase C Carbonic anhydrase II (CA-II) Carbonic anhydrase II (hCA II) | Carbonic anhydrase isoenzyme II (hCA II)
Type:
Enzyme
Mol. Mass.:
29250.71
Organism:
Homo sapiens (Human)
Description:
P00918
Residue:
260
  
Inhibitor
Name:
BDBM50079047
Synonyms:
3-Amino-benzenesulfonamide CHEMBL6852
Type:
Small organic molecule
Emp. Form.:
C6H8N2O2S
Mol. Mass.:
172.205
SMILES:
Nc1cccc(c1)S(N)(=O)=O
: